Secbumeton

Kovats' RI, non-polar column, temperature ramp

View large format table.

Column type Active phase I Reference Comment
CapillaryDB-11777.Hall, Whitehead, et al., 1986He, 6. K/min; Column length: 15. m; Column diameter: 0.25 mm; Tstart: 100. C; Tend: 270. C
CapillaryDB-51828.Hall, Whitehead, et al., 1986He, 6. K/min; Column length: 15. m; Column diameter: 0.25 mm; Tstart: 100. C; Tend: 270. C

Kovats' RI, polar column, isothermal

View large format table.

Column type Active phase Temperature (C) I Reference Comment
PackedCarbowax 20M215.2676.Leclercq and Pacáková, 1979N2, Chromosorb W
PackedCarbowax 20M190.2708.Matisová, Krupcík, et al., 1979N2, Chromosorb W AW (80-100 mesh); Column length: 1.3 m
PackedCarbowax 20M215.2676.Pacáková and Nemec, 1978N2, Chromosorb W; Column length: 1.4 m

Normal alkane RI, polar column, custom temperature program

View large format table.

Column type Active phase I Reference Comment
CapillaryCarbowax 400, Carbowax 20M, Carbowax 1540, Carbowax 4000, Superox 06, PEG 20M, etc.2676.Waggott and Davies, 1984Hydrogen; Column length: 50. m; Column diameter: 0.32 mm; Program: not specified

References

Hall, Whitehead, et al., 1986
Hall, G.L.; Whitehead, W.E.; Mourer, C.R.; Shibamoto, T., A new gas chromatographic retention index for pesticides and related compounds, J. Hi. Res. Chromatogr. Chromatogr. Comm., 1986, 9, 5, 266-271, https://doi.org/10.1002/jhrc.1240090503 . [all data]

Leclercq and Pacáková, 1979
Leclercq, P.A.; Pacáková, V., Gas Chromatography and Mass Spectrometry of Bis(alkylamino)-s-triazines, J. Chromatogr., 1979, 178, 1, 193-207, https://doi.org/10.1016/S0021-9673(00)89708-3 . [all data]

Matisová, Krupcík, et al., 1979
Matisová, E.; Krupcík, J.; Líska, O.; Szentiványi, N., Qualitative analysis of multi-component s-triazine herbicides by gas-liquid chromatography, J. Chromatogr., 1979, 169, 261-269, https://doi.org/10.1016/0021-9673(75)85049-7 . [all data]

Pacáková and Nemec, 1978
Pacáková, V.; Nemec, I., Gas chromatographic, spectrophotometric and electrochemical behaviour of subsitituted s-triazines, J. Chromatogr., 1978, 148, 1, 273-281, https://doi.org/10.1016/S0021-9673(00)99348-8 . [all data]

Waggott and Davies, 1984
Waggott, A.; Davies, I.W., Identification of organic pollutants using linear temperature programmed retention indices (LTPRIs) - Part II, 1984, retrieved from http://dwi.defra.gov.uk/research/completed-research/reports/dwi0383.pdf. [all data]