Diacetamate

Phase change data

Data compiled by: William E. Acree, Jr., James S. Chickos

Enthalpy of fusion

ΔfusH (kJ/mol) Temperature (K) Reference
30.97427.5Bhalla and Lalla, 1990

References

Bhalla and Lalla, 1990
Bhalla, D.V.; Lalla, J.K., Chewable Tablets of Acetaminophen-Prodrung Approach, Drug Development and Industrial Pharmacy, 1990, 16, 1, 115-135, https://doi.org/10.3109/03639049009115989 . [all data]