CAS Reg. No. 26232-84-8

Reaction thermochemistry data

Data compiled by: John E. Bartmess

Individual Reactions

(CAS Reg. No. 26232-84-8 • 4294967295Butanal) + Butanal = CAS Reg. No. 26232-84-8

By formula: (CAS Reg. No. 26232-84-8 • 4294967295C4H8O) + C4H8O = CAS Reg. No. 26232-84-8

Quantity Value Units Method Reference Comment
Δr175. ± 9.2kJ/molN/ABartmess, Scott, et al., 1979gas phase; value altered from reference due to change in acidity scale

References

Bartmess, Scott, et al., 1979
Bartmess, J.E.; Scott, J.A.; McIver, R.T., Jr., The gas phase acidity scale from methanol to phenol, J. Am. Chem. Soc., 1979, 101, 6047. [all data]