Benzenamine, 4-butyl-N-[(4-methoxyphenyl)methylene]-

Condensed phase thermochemistry data

Data compiled by: Eugene S. Domalski and Elizabeth D. Hearing

Constant pressure heat capacity of liquid

Cp,liquid (J/mol*K) Temperature (K) Reference Comment
477.298.15Shinoda and Mizuno, 1982T = 293 to 333 K. Data given graphically. Cp value is a graphical estimate.
490.300.Janik, Janik, et al., 1975T = 100 to 340 K. Cp value estimated from graphical data.
475.3298.15Shinoda, Maeda, et al., 1974T = 2 to 330 K. Nematic liquid crystal.

References

Shinoda and Mizuno, 1982
Shinoda, T.; Mizuno, M., On the pre-transition phenomenon of n-(p-methoxybenzylidene)-p-n-butylaniline (MBBA), Tokyo Kogyo Shikensho Hokoku, 1982, 77(4), 215-217. [all data]

Janik, Janik, et al., 1975
Janik, J.A.; Janik, J.M.; Mayer, J.; Sciesinska, E.; Sciesinski, J.; Twardowski, J.; Waluga, T.; Witko, W., Calorimetric and infrared study of the phase situation in solid MBBA [N-(p-methoxybenzylidene)-p-(n-butyl)aniline], J. Phys. (Paris) Colloq., 1975, (1), 159-165. [all data]

Shinoda, Maeda, et al., 1974
Shinoda, T.; Maeda, Y.; Enokido, H., Thermodynamic properties of N-(p-methoxybenzylidene)-p-n-butyl-aniline (MBBA) from 2K to its isotropic-liquid phase, J. Chem. Thermodynam., 1974, 6, 921-934. [all data]