[Cobalt(2-methylbenzothiazole)2Cl2]

Phase change data

Data compiled by: William E. Acree, Jr., James S. Chickos

Enthalpy of sublimation

ΔsubH (kJ/mol) Temperature (K) Method Reference Comment
122.6 ± 1.2345.SCMortimer and McNaughton, 1973Based on data from 332. - 356. K.

References

Mortimer and McNaughton, 1973
Mortimer, C.T.; McNaughton, Janice L., The thermal decomposition of transition-metal complexes containing heterocyclic ligands, Thermochimica Acta, 1973, 6, 3, 269-274, https://doi.org/10.1016/0040-6031(73)80035-8 . [all data]