Periciazine

Van Den Dool and Kratz RI, non-polar column, temperature ramp

Data compiled by: NIST Mass Spectrometry Data Center, William E. Wallace, director

Column type CapillaryPacked
Active phase CBP-1SE-30
Column length (m) 12.1.8
Carrier gas N2N2
Substrate  Chromosorb W
Column diameter (mm) 0.53
Phase thickness (μm)
Tstart (C) 120.130.
Tend (C) 250.290.
Heat rate (K/min) 6.8.
Initial hold (min)  2.
Final hold (min)  8.
I 3227.3230.
ReferenceOyama, Sano, et al., 1987Perrigo and Peel, 1981
Comment MSDC-RI MSDC-RI

Normal alkane RI, non-polar column, temperature ramp

Data compiled by: NIST Mass Spectrometry Data Center, William E. Wallace, director

Column type Packed
Active phase SE-30
Column length (m) 2.
Carrier gas Nitrogen
Substrate Chromosorb G AW DMCS (80-100 mesh)
Column diameter (mm)
Phase thickness (μm)
Tstart (C) 100.
Tend (C) 300.
Heat rate (K/min)
Initial hold (min)
Final hold (min)
I 3207.
ReferenceMHA, 9999
Comment MSDC-RI

References

Oyama, Sano, et al., 1987
Oyama, N.; Sano, T.; Syoyama, M.; Maeda, K., Studies on systematic analysis of poisonous compounds in forensic chemistry. II. Application of capillary column gas chromatography to substance identification by means of retention indices, Eisei Kagaku, 1987, 33, 5, 342-348, https://doi.org/10.1248/jhs1956.33.342 . [all data]

Perrigo and Peel, 1981
Perrigo, B.J.; Peel, H.W., The use of retention indices and temperature-programmed gas chromatography in analytical toxicology, J. Chromatogr. Sci., 1981, 19, 5, 219-226, https://doi.org/10.1093/chromsci/19.5.219 . [all data]