4,5-Dimethyl-2-isobutyloxazole

Kovats' RI, polar column, temperature ramp

View large format table.

Column type Active phase I Reference Comment
PackedPEG-20M1330.Galt and MacLeod, 1984N2, Celite, 70. C @ 9. min, 10. K/min; Column length: 5.5 m; Tend: 175. C

Normal alkane RI, non-polar column, custom temperature program

View large format table.

Column type Active phase I Reference Comment
CapillarySE-301044.Vinogradov, 2004Program: not specified

Normal alkane RI, polar column, custom temperature program

View large format table.

Column type Active phase I Reference Comment
CapillaryCarbowax 20M1330.Vinogradov, 2004Program: not specified

References

Galt and MacLeod, 1984
Galt, A.M.; MacLeod, G., Headspace sampling of cooked beef aroma using Tenax GC, J. Agric. Food Chem., 1984, 32, 1, 59-64, https://doi.org/10.1021/jf00121a016 . [all data]

Vinogradov, 2004
Vinogradov, B.A., Production, composition, properties and application of essential oils, 2004, retrieved from http://viness.narod.ru. [all data]