2,3'5,6'-Tetrahydro[2.2]paracyclophane

Gas phase ion energetics data

Data compiled by: Sharon G. Lias, John E. Bartmess, Joel F. Liebman, John L. Holmes, Rhoda D. Levin, and W. Gary Mallard

Ionization energy determinations

IE (eV) Method Reference Comment
8.0PEGleiter, Spanget-Larsen, et al., 1984
8.4PEGleiter, Spanget-Larsen, et al., 1984Vertical value

References

Gleiter, Spanget-Larsen, et al., 1984
Gleiter, R.; Spanget-Larsen, J.; Hopf, H.; Mlynek, C., Photoelectron spectra of some reduction products of [2.2]paracyclophane, Chem. Ber., 1984, 117, 1987. [all data]