Trigermanium trioxide

Gas phase ion energetics data

Data compiled by: Henry M. Rosenstock, Keith Draxl, Bruce W. Steiner, and John T. Herron

Ionization energy determinations

IE (eV) Method Reference
8.6 ± 1.0EIDrowart, Degreve, et al., 1965

References

Drowart, Degreve, et al., 1965
Drowart, J.; Degreve, F.; Verhaegen, G.; Colin, R., Thermochemical study of the germanium oxides using a mass spectrometer. Dissociation energy of the molecule GeO, J. Chem. Soc. Faraday Trans., 1965, 61, 1072. [all data]