Benzo[g]quinoline

Gas phase thermochemistry data

Data compiled by: Hussein Y. Afeefy, Joel F. Liebman, and Stephen E. Stein

Quantity Value Units Method Reference Comment
Δfgas243.5 ± 5.5kJ/molCcbMcEachern, Iniguez, et al., 1975

Condensed phase thermochemistry data

Data compiled by: Hussein Y. Afeefy, Joel F. Liebman, and Stephen E. Stein

Quantity Value Units Method Reference Comment
Δcsolid-6550.8 ± 3.7kJ/molCcbMcEachern, Iniguez, et al., 1975

Phase change data

Data compiled by: Hussein Y. Afeefy, Joel F. Liebman, and Stephen E. Stein

Quantity Value Units Method Reference Comment
Δsub94.6 ± 3.8kJ/molVMcEachern, Iniguez, et al., 1975

Reaction thermochemistry data

Data compiled by: Hussein Y. Afeefy, Joel F. Liebman, and Stephen E. Stein

Individual Reactions

Benzo[g]isoquinoline dimer = 2Benzo[g]quinoline

By formula: C26H18N2 = 2C13H9N

Quantity Value Units Method Reference Comment
Δr-69.8kJ/molCmBendig, Buchwitz, et al., 1981liquid phase; solvent: Cyclohexane; Dimerization

Gas phase ion energetics data

Data compiled by: Henry M. Rosenstock, Keith Draxl, Bruce W. Steiner, and John T. Herron

Ionization energy determinations

IE (eV) Method Reference
7.6 ± 0.1CTSFarrell and Newton, 1966

References

McEachern, Iniguez, et al., 1975
McEachern, D.M.; Iniguez, J.C.; Ornelas, H.C., Enthalpies of combustion and sublimation and vapor pressures of three benzoquinolines, J. Chem. Eng. Data, 1975, 20, 226-228. [all data]

Bendig, Buchwitz, et al., 1981
Bendig, J.; Buchwitz, W.; Fischer, J.; Kreysig, D., Deactivation behavior of arenes and heteroarenes. XXXII. Effect of endo- and exocyclic substitution on the reversible dimerization behavior of anthracenes, J. Prakt. Chem., 1981, 323, 485-498. [all data]

Farrell and Newton, 1966
Farrell, P.G.; Newton, J., Ionization potentials of primary aromatic amines and aza-hydrocarbons, Tetrahedron Lett., 1966, 5517. [all data]