1,4,5,6,7,8,8-Heptachloro-3a,4,7,7a-tetrahydro-4,7-methanoindan

Phase change data

Data compiled by: William E. Acree, Jr., James S. Chickos

Enthalpy of vaporization

ΔvapH (kcal/mol) Temperature (K) Reference Comment
20.0343.Dykyj, Svoboda, et al., 1999Based on data from 333. - 353. K.

Enthalpy of sublimation

ΔsubH (kcal/mol) Temperature (K) Reference Comment
20.0343.Stephenson and Malanowski, 1987Based on data from 333. - 353. K. See also Bessarab, Chernoglazova, et al., 1974.

References

Dykyj, Svoboda, et al., 1999
Dykyj, J.; Svoboda, J.; Wilhoit, R.C.; Frenkel, M.L.; Hall, K.R., Vapor Pressure of Chemicals: Part A. Vapor Pressure and Antoine Constants for Hydrocarbons and Sulfur, Selenium, Tellurium and Hydrogen Containing Organic Compounds, Springer, Berlin, 1999, 373. [all data]

Stephenson and Malanowski, 1987
Stephenson, Richard M.; Malanowski, Stanislaw, Handbook of the Thermodynamics of Organic Compounds, 1987, https://doi.org/10.1007/978-94-009-3173-2 . [all data]

Bessarab, Chernoglazova, et al., 1974
Bessarab, N.A.; Chernoglazova, F.S.; Martynov, Y.M., Zh. Fiz. Khim., 1974, 48, 235. [all data]