Naphthalene, 1-bromo-2-methyl-

Phase change data

Data compiled by: Robert L. Brown and Stephen E. Stein

Quantity Value Units Method Reference Comment
Tboil569.2KN/AAldrich Chemical Company Inc., 1990

Reduced pressure boiling point

Tboil (K) Pressure (atm) Reference
430.0.020American Tokyo Kasei, 1988

References

Aldrich Chemical Company Inc., 1990
Aldrich Chemical Company Inc., Catalog Handbook of Fine Chemicals, Aldrich Chemical Company, Inc., Milwaukee WI, 1990, 1. [all data]

American Tokyo Kasei, 1988
American Tokyo Kasei, TCI American Organic Chemical 88/89 Catalog, American Tokyo Kasei, Portland, OR, 1988, 1610. [all data]