Pyrazine, 2-methoxy-3-(1-methylethyl)-

Normal alkane RI, polar column, temperature ramp

Data compiled by: NIST Mass Spectrometry Data Center, William E. Wallace, director

Column type CapillaryCapillaryCapillaryCapillaryCapillary
Active phase TC-WaxFFAPTC-WaxDB-WaxDB-FFAP
Column length (m) 60.30.60.60.30.
Carrier gas HeliumHeliumHeliumHeliumHe
Substrate
Column diameter (mm) 0.250.320.250.250.32
Phase thickness (μm)  0.25 0.250.25
Tstart (C) 40.40.40.50.40.
Tend (C) 230.240.230.220.230.
Heat rate (K/min) 3.6.3.3.6.
Initial hold (min) 3.2. 2.1.
Final hold (min)    70.
I 1446.1427.1446.1423.1435.
ReferenceMiyazawa, Fujita, et al., 2010Christlbauer and Schieberle, 2009Miyazawa, Nakanishi, et al., 2009Shimizu, Imayoshi, et al., 2009Zeller and Rychlik, 2007
Comment MSDC-RI MSDC-RI MSDC-RI MSDC-RI MSDC-RI
Column type CapillaryCapillaryCapillaryCapillaryCapillary
Active phase DB-WaxTC-WAX FFSDB-FFAPDB-FFAPFFAP
Column length (m) 60.60.30.30.30.
Carrier gas HeliumHeHeHeHe
Substrate
Column diameter (mm) 0.250.250.320.320.32
Phase thickness (μm) 0.25 0.250.250.25
Tstart (C) 35.60.40.40.40.
Tend (C) 240.240.230.195.230.
Heat rate (K/min) 6.3.6.5.6.
Initial hold (min) 3. 2.5.2.
Final hold (min) 10. 5.40.5.
I 1425.1447.1420.1412.1419.
ReferenceSpadone, Matthey-Doret, et al., 2006Miyazawa, Maehara, et al., 2002Sanz, Czerny, et al., 2002Suriyaphan, Drake, et al., 2001Czerny and Grosch, 2000
Comment MSDC-RI MSDC-RI MSDC-RI MSDC-RI MSDC-RI
Column type CapillaryCapillaryCapillary
Active phase DB-WaxCarbowax 20MCarbowax 20M
Column length (m) 30.50.50.
Carrier gas He N2
Substrate
Column diameter (mm) 0.320.220.22
Phase thickness (μm) 0.25
Tstart (C) 50.80.80.
Tend (C) 240.200.200.
Heat rate (K/min) 6.2.2.
Initial hold (min) 3.
Final hold (min)
I 1394.1400.1400.
ReferenceHashizume and Samuta, 1997Mihara and Masuda, 1988Mihara and Enomoto, 1985
Comment MSDC-RI MSDC-RI MSDC-RI

Normal alkane RI, non-polar column, custom temperature program

Data compiled by: NIST Mass Spectrometry Data Center, William E. Wallace, director

Column type CapillaryCapillaryCapillaryCapillaryCapillary
Active phase SE-54DB-5HP-5HP-5DB-1
Column length (m) 30.30.30.30.30.
Carrier gas HeliumHeliumHeHeHe
Substrate
Column diameter (mm) 0.320.250.250.250.25
Phase thickness (μm) 0.250.250.250.250.25
Program 35 0C (2 min) 10 0C/min -> 50 0C (2 min) 6 0C/min -> 250 0C50 0C m6 0C/min -> 140 0C 5 0C/min -> 160 0C (1 min) 10 0C/min -> 200 0C50 C(1min) => 20C/min => 80C => 25C/min => 250C (3 min)50 C(1min) => 20C/min => 80C => 25C/min => 250C (3 min)60C => 4C/min => 200C (5min) => 10C/min => 280C (20min)
I 1096.1091.1097.1099.1089.
ReferenceChristlbauer and Schieberle, 2009Courtois, Paine, et al., 2009Hartmann, 2003Hartmann, 2003Variyar, Ahmad, et al., 2003
Comment MSDC-RI MSDC-RI MSDC-RI MSDC-RI MSDC-RI
Column type CapillaryCapillaryCapillaryCapillaryCapillary
Active phase CP Sil 5 CBHP-5CP Sil 8 CBRTX-5SE-54
Column length (m) 50.30.60. 30.
Carrier gas     He
Substrate
Column diameter (mm) 0.320.250.25 0.32
Phase thickness (μm) 1.20.250.25 0.25
Program 36C => 20C/min => 85C => 1C/min => 145C=3C/min => 250C(30min)40C (5min) => 10C/min => 80C => 20C/min => 230C (5min)not specifiednot specified35C (2min) => 40C/min => 60C (2min) => 6C/min => 180C => 10C/min => 240C
I 1081.1099.1097.1097.1097.
ReferenceCounet, Callemien, et al., 2002Hartmann, McNair, et al., 2002Duckham, Dodson, et al., 2001Masanetz, Guth, et al., 1998Schermann and Schieberle, 1997
Comment MSDC-RI MSDC-RI MSDC-RI MSDC-RI MSDC-RI
Column type CapillaryCapillaryCapillaryCapillary
Active phase SE-54SE-54RSL-150OV-1, SE-30, Methyl silicone, SP-2100, OV-101, DB-1, etc.
Column length (m) 30.30.60.50.
Carrier gas HeHeHeHydrogen
Substrate
Column diameter (mm) 0.320.320.320.32
Phase thickness (μm) 0.250.250.25
Program 35C (2min) => 40C/min => 60C (2min) => 6C/min => 180C => 10C/min => 240C35C (2min) => 40C/min => 60C (2min) => 6C/min => 180C => 10C/min => 240C30c (1.5min) => 20C/min => 55C => 6C/min => 200C(10min)not specified
I 1097.1097.1077.1078.
ReferenceSchermann and Schieberle, 1997Schermann and Schieberle, 1997Buchbauer, Nikiforov, et al., 1994Waggott and Davies, 1984
Comment MSDC-RI MSDC-RI MSDC-RI MSDC-RI

References

Miyazawa, Fujita, et al., 2010
Miyazawa, N.; Fujita, A.; Kubota, K., Aroma character impact compounds in Kinokuni Mandarin Orange (Citrus kinikuni) compared with Satsuma Mandarin Orange, Biosci. Biotechnol. Biochem., 2010, 74, 4, 835-842, https://doi.org/10.1271/bbb.90937 . [all data]

Christlbauer and Schieberle, 2009
Christlbauer, M.; Schieberle, P., Characterization of the key aroma compounds in beef and pork vegetable gravies a la chef by application of the aroma extract dilution analysis, J. Agric. Food Chem., 2009, 57, 19, 9114-9112, https://doi.org/10.1021/jf9023189 . [all data]

Miyazawa, Nakanishi, et al., 2009
Miyazawa, N.; Nakanishi, A.; Tomita, N.; Ohkubo, Y.; Maeda, T.; Fujita, A., Novel key aroma components of Galbanum oil, J. Agric. Food Chem., 2009, 57, 4, 1433-1439, https://doi.org/10.1021/jf803157j . [all data]

Shimizu, Imayoshi, et al., 2009
Shimizu, Y.; Imayoshi, Y.; Kato, M.; Maeda, K.; Iwabuchi, H.; Shimomura, K., Volatiles from leaves of field-grown plants and shoot cultures of Gynura bicolor DC, Flavour Fragr. J., 2009, 24, 5, 251-258, https://doi.org/10.1002/ffj.1938 . [all data]

Zeller and Rychlik, 2007
Zeller, A.; Rychlik, M., Impact of estragole and other odorants on the flavour of anise and tarragon, Flavour Fragr. J., 2007, 22, 2, 105-113, https://doi.org/10.1002/ffj.1765 . [all data]

Spadone, Matthey-Doret, et al., 2006
Spadone, J.-C.; Matthey-Doret, W.; Blank, I., Formation of methyl(methylthio)methyl disulfide in broccoli (Brassica oleracea (L.) var. italica) in Flavour Science: Recent Advances and Trends, Bredie, W.L.P.; Petersen, M.A., ed(s)., Elsevier, Amsterdam, 2006, 309-314. [all data]

Miyazawa, Maehara, et al., 2002
Miyazawa, M.; Maehara, T.; Kurose, K., Composition of the essential oil from the leaves of Eruca sativa, Flavour Fragr. J., 2002, 17, 3, 187-190, https://doi.org/10.1002/ffj.1079 . [all data]

Sanz, Czerny, et al., 2002
Sanz, C.; Czerny, M.; Cid, C.; Schieberle, P., Comparison of potent odorants in a filtered coffee brew and in an instant coffee beverage by aroma extract dilution analysis (AEDA), Eur. Food Res. Technol., 2002, 214, 4, 299-302, https://doi.org/10.1007/s00217-001-0459-9 . [all data]

Suriyaphan, Drake, et al., 2001
Suriyaphan, O.; Drake, M.; Chen, X.Q.; Cadwallader, K.R., Characteristic aroma components of British farmhouse cheddar cheese, J. Agric. Food Chem., 2001, 49, 3, 1382-1387, https://doi.org/10.1021/jf001121l . [all data]

Czerny and Grosch, 2000
Czerny, M.; Grosch, W., Potent odorants of raw Arabica coffee. Their changes during roasting, J. Agric. Food Chem., 2000, 48, 3, 868-872, https://doi.org/10.1021/jf990609n . [all data]

Hashizume and Samuta, 1997
Hashizume, K.; Samuta, T., Green odorants of grape cluster stem and their ability to cause a wine stemmy flavor, J. Agric. Food Chem., 1997, 45, 4, 1333-1337, https://doi.org/10.1021/jf960635a . [all data]

Mihara and Masuda, 1988
Mihara, S.; Masuda, H., Structure-odor relationships for disubstituted pyrazines, J. Agric. Food Chem., 1988, 36, 6, 1242-1247, https://doi.org/10.1021/jf00084a029 . [all data]

Mihara and Enomoto, 1985
Mihara, S.; Enomoto, N., Calculation of retention indices of pyrazines on the basis of molecular structure, J. Chromatogr., 1985, 324, 428-430, https://doi.org/10.1016/S0021-9673(01)81342-X . [all data]