Octalene

Gas phase thermochemistry data

Data compiled by: Hussein Y. Afeefy, Joel F. Liebman, and Stephen E. Stein

Quantity Value Units Method Reference Comment
Δfgas131.8kcal/molChydRoth, Adamczak, et al., 1991

Reaction thermochemistry data

Data compiled by: Hussein Y. Afeefy, Joel F. Liebman, and Stephen E. Stein

Individual Reactions

7Hydrogen + Octalene = C14H26

By formula: 7H2 + C14H12 = C14H26

Quantity Value Units Method Reference Comment
Δr-157.2 ± 0.3kcal/molChydRoth, Lennartz, et al., 1986liquid phase; solvent: Cyclohexane

References

Roth, Adamczak, et al., 1991
Roth, W.R.; Adamczak, O.; Breuckmann, R.; Lennartz, H.-W.; Boese, R., Die Berechnung von Resonanzenergien; das MM2ERW-Kraftfeld, Chem. Ber., 1991, 124, 2499-2521. [all data]

Roth, Lennartz, et al., 1986
Roth, W.E.; Lennartz, H.W.; Vogel, E.; Leiendecker, M.; Masaji, O., Heats of hydrogenation. 6. Resonance energy of fused [4n]annulenes, Chem. Ber., 1986, 119, 837-843. [all data]