Polydimethylsilamethylene

Condensed phase thermochemistry data

Data compiled by: Eugene S. Domalski and Elizabeth D. Hearing

Quantity Value Units Method Reference Comment
liquid157.2J/mol*KN/ALebedev, Rabinovich, et al., 1978

Constant pressure heat capacity of liquid

Cp,liquid (J/mol*K) Temperature (K) Reference Comment
137.6298.15Lebedev, Rabinovich, et al., 1978T = 60 to 330 K. Rubber like elastic state.

Phase change data

Data compiled by: Eugene S. Domalski and Elizabeth D. Hearing

Enthalpy of fusion

ΔfusH (kJ/mol) Temperature (K) Reference Comment
8.000266.Lebedev, Rabinovich, et al., 1978

Entropy of fusion

ΔfusS (J/mol*K) Temperature (K) Reference Comment
30.266.Lebedev, Rabinovich, et al., 1978

References

Lebedev, Rabinovich, et al., 1978
Lebedev, B.V.; Rabinovich, I.B.; Lebedev, N.K.; Ushakov, N.V., Thermodynamics of the polymerization of a number of silacycloalkanes, Dokl. Akad. Nauk SSSR, 1978, 239(5), 1140-1143. [all data]