Poly(oxacyclobutane)

Condensed phase thermochemistry data

Data compiled by: Eugene S. Domalski and Elizabeth D. Hearing

Constant pressure heat capacity of solid

Cp,solid (J/mol*K) Temperature (K) Reference Comment
125.9302.13Yoshida, Sakiyama, et al., 1970glass phase; T = 90 to 320 K. Cp at 302.13 K is unsmoothed experimental datum. Data also given graphically. Cp reported as 2.170 J/g*K at 302.13 K for annealed sample. Cp given for quenched sample from 95 to 205 K.

References

Yoshida, Sakiyama, et al., 1970
Yoshida, S.; Sakiyama, M.; Seki, S., Thermodynamic studies of solid polyethers. I. Poly(oxacyclobutane),[-(CH2)3O-]n and its hydrate, Polymer Journal, 1970, 1, 573-581. [all data]