1,3-Dioxolane, 2-ethyl-

Kovats' RI, non-polar column, isothermal

View large format table.

Column type Active phase Temperature (C) I Reference Comment
CapillaryOV-101130.774.Misharina and Golovnya, 1994He; Column length: 50. m; Column diameter: 0.32 mm
CapillarySE-52130.787.Misharina and Golovnya, 199460. m/0.32 mm/2. μm, He
CapillaryOV-101110.735.Misharina, Golovnya, et al., 199250. m/0.32 mm/0.5 μm, He
CapillaryOV-101130.738.Misharina, Golovnya, et al., 199250. m/0.32 mm/0.5 μm, He

Van Den Dool and Kratz RI, non-polar column, temperature ramp

View large format table.

Column type Active phase I Reference Comment
CapillaryOV-101730.Misharina, Golovnya, et al., 199250. m/0.32 mm/0.5 μm, He, 4. K/min; Tstart: 50. C; Tend: 200. C

References

Misharina and Golovnya, 1994
Misharina, T.A.; Golovnya, R.V., Spectral and gas-chromatographic characterization of 4-methyl-2-alkyl substituted 1,3-oxothiolanes and 1,3-dithiolanes, Zh. Anal. Khim., 1994, 49, 4, 395-401. [all data]

Misharina, Golovnya, et al., 1992
Misharina, T.A.; Golovnya, R.V.; Yakovleva, V.N., GC-MS and GC-FTIR characteristics of 2-alkyl- and 4-methyl-2-alkyl-1,3-dioxolans, Zh. Anal. Khim., 1992, 47, 304-311. [all data]