Bicyclo[4.1.0]hept-2-ene

Gas phase thermochemistry data

Data compiled by: Hussein Y. Afeefy, Joel F. Liebman, and Stephen E. Stein

Quantity Value Units Method Reference Comment
Δfgas119.kJ/molChydRoth, Klarner, et al., 1992

Gas phase ion energetics data

Data compiled as indicated in comments:
LLK - Sharon G. Lias, Rhoda D. Levin, and Sherif A. Kafafi

Ionization energy determinations

IE (eV) Method Reference Comment
8.69PEHeilbronner, Gleiter, et al., 1973Vertical value; LLK

References

Roth, Klarner, et al., 1992
Roth, W.R.; Klarner, F.-G.; Siepert, G.; Lennartz, H.-W., Zur Frage der Homoaromatizitat von Norcaradien und Cycloheptatrien, Chem. Ber., 1992, 125, 217-224. [all data]

Heilbronner, Gleiter, et al., 1973
Heilbronner, E.; Gleiter, R.; Hoshi, T.; Meijere, A., The interaction of Walsh-orbitals in diademane and related hydrocarbons, Helv. Chim. Acta, 1973, 56, 1594. [all data]