2-Methylbutanenitrile radical

Gas phase ion energetics data

Data compiled by: John E. Bartmess

Electron affinity determinations

EA (eV) Reference Comment
0.012881 ± 0.000087Hammer, Diri, et al., 2003

References

Hammer, Diri, et al., 2003
Hammer, N.I.; Diri, K.; Jordan, K.D.; Desfrancois, C.; Compton, R.N., Dipole-bound anions of carbonyl, nitrile, and sulfoxide containing molecules, J. Chem. Phys., 2003, 119, 7, 3650-3660, https://doi.org/10.1063/1.1590959 . [all data]