Dicumenylmethane

Phase change data

Data compiled as indicated in comments:
TRC - Thermodynamics Research Center, NIST Boulder Laboratories, Chris Muzny director
AC - William E. Acree, Jr., James S. Chickos

Quantity Value Units Method Reference Comment
Tc795.KN/ANikitin, Pavlov, et al., 1993Uncertainty assigned by TRC = 8. K; TRC
Quantity Value Units Method Reference Comment
Pc155.00barN/ANikitin, Pavlov, et al., 1993Uncertainty assigned by TRC = 3.00 bar; TRC

Enthalpy of vaporization

ΔvapH (kJ/mol) Temperature (K) Method Reference Comment
71.318.N/ADykyj, Svoboda, et al., 1999Based on data from 303. - 402. K.; AC
57.9623.N/ADykyj, Svoboda, et al., 1999Based on data from 608. - 704. K.; AC
73.7338.AStephenson and Malanowski, 1987Based on data from 323. - 402. K.; AC

In addition to the Thermodynamics Research Center (TRC) data available from this site, much more physical and chemical property data is available from the following TRC products:

References

Nikitin, Pavlov, et al., 1993
Nikitin, E.D.; Pavlov, P.A.; Skripov, P.V., Measurement of the critical properties of thermally unstable substances and mixtures by the pulse-heating method, J. Chem. Thermodyn., 1993, 25, 869-80. [all data]

Dykyj, Svoboda, et al., 1999
Dykyj, J.; Svoboda, J.; Wilhoit, R.C.; Frenkel, M.L.; Hall, K.R., Vapor Pressure of Chemicals: Part A. Vapor Pressure and Antoine Constants for Hydrocarbons and Sulfur, Selenium, Tellurium and Hydrogen Containing Organic Compounds, Springer, Berlin, 1999, 373. [all data]

Stephenson and Malanowski, 1987
Stephenson, Richard M.; Malanowski, Stanislaw, Handbook of the Thermodynamics of Organic Compounds, 1987, https://doi.org/10.1007/978-94-009-3173-2 . [all data]