(E) 4-(N,N-dimethylamino)azobenzene

Phase change data

Data compiled by: William E. Acree, Jr., James S. Chickos

Enthalpy of sublimation

ΔsubH (kJ/mol) Temperature (K) Method Reference
132. ± 8.381.TECampanelli, Ferro, et al., 1985

References

Campanelli, Ferro, et al., 1985
Campanelli, A.R.; Ferro, D.; Pavel, N.V., Study of the 4:1 inclusion compound between deoxycholic acid and (E)-p-dimethylaminoazobenzene by vapour pressure measurements, Thermochimica Acta, 1985, 87, 231-238, https://doi.org/10.1016/0040-6031(85)85340-5 . [all data]