4-mercapto-4-methyl-2-pentanol

Van Den Dool and Kratz RI, non-polar column, temperature ramp

Data compiled by: NIST Mass Spectrometry Data Center, William E. Wallace, director

Column type Capillary
Active phase HP-5
Column length (m) 30.
Carrier gas He
Substrate
Column diameter (mm) 0.25
Phase thickness (μm) 0.25
Tstart (C) 50.
Tend (C) 250.
Heat rate (K/min) 4.
Initial hold (min) 5.
Final hold (min) 15.
I 1039.
ReferenceMahattanatawee, Goodner, et al., 2005
Comment MSDC-RI

References

Mahattanatawee, Goodner, et al., 2005
Mahattanatawee, K.; Goodner, K.L.; Baldwin, E.A., Volatile constituents and character impact compounds of selected Florida's tropical fruit, Proc. Fla. State Hort. Soc., 2005, 118, 414-418. [all data]