Disulfur dinitride

Gas phase ion energetics data

Data compiled by: Sharon G. Lias, Rhoda D. Levin, and Sherif A. Kafafi

Ionization energy determinations

IE (eV) Method Reference Comment
10.41PEFrost, LeGeyt, et al., 1977
11.5 ± 0.6EISmith, Wyatt, et al., 1976
10.51PEFindlay, Palmer, et al., 1980Vertical value

Appearance energy determinations

Ion AE (eV) Other Products MethodReferenceComment
NS+13.0 ± 0.6?EISmith, Wyatt, et al., 1976
NS2+12.2 ± 0.6NEISmith, Wyatt, et al., 1976

References

Frost, LeGeyt, et al., 1977
Frost, D.C.; LeGeyt, M.R.; Paddock, N.L.; Westwood, N.P.C., Helium I photoelectron spectrum of disulphur dinitride, J. Chem. Soc., Chem. Commun., 1977, 217. [all data]

Smith, Wyatt, et al., 1976
Smith, R.D.; Wyatt, J.R.; DeCorpo, J.J.; Saalfeld, F.E.; Moran, M.J.; MacDiarmid, A.G., Identification of the vapor phase species of (SN) 9x 8, Chem. Phys. Lett., 1976, 41, 362. [all data]

Findlay, Palmer, et al., 1980
Findlay, R.H.; Palmer, M.H.; Downs, A.J.; Egdell, R.G.; Evans, R., Electronic structure of the sulfur nitrides. Ab initio calculations and photoelectron spectra, Inorg. Chem., 1980, 19, 1307. [all data]