trans-4a-Methyl-decahydronaphthalene

Condensed phase thermochemistry data

Data compiled by: Hussein Y. Afeefy, Joel F. Liebman, and Stephen E. Stein

Quantity Value Units Method Reference Comment
Δfliquid-249.8 ± 1.8kJ/molCcbDauben and Rohr, 1960
Quantity Value Units Method Reference Comment
Δcliquid-6937.2 ± 1.7kJ/molCcbDauben and Rohr, 1960Corresponding Δfliquid = -249.7 kJ/mol (simple calculation by NIST; no Washburn corrections)

Reaction thermochemistry data

Data compiled by: Hussein Y. Afeefy, Joel F. Liebman, and Stephen E. Stein

Individual Reactions

cis-4a-Methyl-decahydronaphthalene = trans-4a-Methyl-decahydronaphthalene

By formula: C11H20 = C11H20

Quantity Value Units Method Reference Comment
Δr-2.3 ± 1.2kJ/molEqkAllinger and Coke, 1961liquid phase; At 584 K

References

Dauben and Rohr, 1960
Dauben, W.G.; Rohr, O., The heat of isomerization of the cis and trans isomers of 9-methyldecahydronaphthalene, J. Phys. Chem., 1960, 64, 283-284. [all data]

Allinger and Coke, 1961
Allinger, N.L.; Coke, J.L., Relative stabilities of cis and trans isomers. XI. The 9-methyldecalins, 1961, 2096-2097. [all data]