Niacin, TMS derivative

Normal alkane RI, non-polar column, custom temperature program

Data compiled by: NIST Mass Spectrometry Data Center, William E. Wallace, director

Column type CapillaryCapillary
Active phase Polydimethyl siloxane, 5 % phenyl groupsRTx-5 Sil MS
Column length (m)  30.
Carrier gas  Helium
Substrate
Column diameter (mm)  0.25
Phase thickness (μm)  0.25
Program not specified70 0C (1 min) 1 0C/min -> 76 0C 6.09 0C/min -> 350 0C (1 min) -> 330 0C (10 min)
I 1257.1304.
ReferenceKumari, Stevens, et al., 2011Birkemeier and Kopka, 2007
Comment MSDC-RI MSDC-RI

References

Kumari, Stevens, et al., 2011
Kumari, S.; Stevens, D.; Kind, T.; Denkert, C.; Fiehn, O., Applying in-silico retention index and mass spectra matching for identification of unknown metabolites in accurate mass GC-TOF mass spectrometry, Anal. Chem., 2011, 83, 15, 5895-5902, https://doi.org/10.1021/ac2006137 . [all data]

Birkemeier and Kopka, 2007
Birkemeier, C.; Kopka, J., Design of metabolite recovery by variations of the metabolite profiling protocol in Concepts in Plant Metabolomics, Nikolau, B.J.; Wurtele, E.S., ed(s)., Springer, Dordrecht, Netheralnds, 2007, 45-69. [all data]