Dispiro[2.1.2.1]octane

Gas phase ion energetics data

Data compiled as indicated in comments:
LLK - Sharon G. Lias, Rhoda D. Levin, and Sherif A. Kafafi

Ionization energy determinations

IE (eV) Method Reference Comment
8.8PEHemmersbach and Klessinger, 1980LLK
9.21PEHemmersbach and Klessinger, 1980Vertical value; LLK

Phase change data

Data compiled by: William E. Acree, Jr., James S. Chickos

Enthalpy of vaporization

ΔvapH (kJ/mol) Temperature (K) Method Reference
32.2278. - 362.DSCBeckhaus, Ruechardt, et al., 1995

References

Hemmersbach and Klessinger, 1980
Hemmersbach, P.; Klessinger, M., Der Einfluss von Wechselwirkungen durch den Raum und uber Bindungen auf die Walsh-Orbitale von Spirocyclopropylverbindungen, Tetrahedron, 1980, 36, 1337. [all data]