Di-tert-butyl gallium dipropyldithiocarbamate

Phase change data

Data compiled by: William E. Acree, Jr., James S. Chickos

Enthalpy of vaporization

ΔvapH (kcal/mol) Temperature (K) Method Reference
11. ± 0.2365. - 424.TGAKeys, Bott, et al., 1999

References

Keys, Bott, et al., 1999
Keys, Andrea; Bott, Simon G.; Barron, Andrew R., MOCVD Growth of Gallium Sulfide Using Di- tert -butyl Gallium Dithiocarbamate Precursors: Formation of a Metastable Phase of GaS, Chem. Mater., 1999, 11, 12, 3578-3587, https://doi.org/10.1021/cm9903632 . [all data]