2-heptyl-1-nonanol

Phase change data

Data compiled by: Thermodynamics Research Center, NIST Boulder Laboratories, Chris Muzny director

Quantity Value Units Method Reference Comment
Tfus252.KN/ACox and Reid, 1935Uncertainty assigned by TRC = 10. K

In addition to the Thermodynamics Research Center (TRC) data available from this site, much more physical and chemical property data is available from the following TRC products:

References

Cox and Reid, 1935
Cox, W.M.; Reid, E.E., Some Isomeric Branched Hexadecanols, J. Am. Chem. Soc., 1935, 57, 1801-2. [all data]