Bicyclo[3.2.1]octane-2,3,4-trione

Gas phase ion energetics data

Data compiled by: Sharon G. Lias, Rhoda D. Levin, and Sherif A. Kafafi

Ionization energy determinations

IE (eV) Method Reference Comment
9.49PEBischof, Gleiter, et al., 1975Vertical value

References

Bischof, Gleiter, et al., 1975
Bischof, P.; Gleiter, R.; Hofmann, P., 229. Photoelectron spectra of vicinal tricarbonyls, Helv. Chim. Acta, 1975, 58, 2130. [all data]