Acetamide, N-(p-hydroxy-α-methylphenethyl)-, acetate (ester)

Kovats' RI, non-polar column, temperature ramp

View large format table.

Column type Active phase I Reference Comment
CapillaryHP-11900.Staack, Fehn, et al., 200312. m/0.2 mm/0.33 μm, He, 100. C @ 3. min, 30. K/min, 310. C @ 8. min
CapillaryCross-Linked Methylsilicone1900.Kraemer, Theis, et al., 200012. m/0.2 mm/0.33 μm, He, 100. C @ 3. min, 30. K/min, 310. C @ 8. min

References

Staack, Fehn, et al., 2003
Staack, R.F.; Fehn, J.; Maurer, H.H., New designer drug p-methoxymethamphetamine: studies on its metabolism and toxicological detection in urine using gas chromatography-mass spectrometry, J. Chromatogr. B, 2003, 789, 1, 27-41, https://doi.org/10.1016/S1570-0232(02)01018-8 . [all data]

Kraemer, Theis, et al., 2000
Kraemer, T.; Theis, G.A.; Weber, A.A.; Maurer, H.H., Studies on the metabolism and toxicological detection of the amphetamine-like anorectic fenproporex in human urine by gas chromatography-mass spectrometry and fluorescence polarization immunoassay, J. Chromatogr. B, 2000, 738, 1, 107-118, https://doi.org/10.1016/S0378-4347(99)00497-1 . [all data]