Butanoic acid, 4-(2,4,5-trichlorophenoxy)-, methyl ester

Kovats' RI, non-polar column, isothermal

View large format table.

Column type Active phase Temperature (C) I Reference Comment
PackedDC-200165.1955.de Beer, van Peteghem, et al., 1978
PackedDC-200165.1955.de Beer, van Peteghem, et al., 1978

Kovats' RI, polar column, isothermal

View large format table.

Column type Active phase Temperature (C) I Reference Comment
PackedFFAP165.2720.de Beer, van Peteghem, et al., 1978Column length: 1.8 m
PackedFFAP165.2720.de Beer, van Peteghem, et al., 1978Column length: 1.8 m

References

de Beer, van Peteghem, et al., 1978
de Beer, J.; van Peteghem, C.; Heyndrickx, A., Comparative Study of the Gas-Liquid Chromatographic Behaviour of the Pentafluorobenzyl Esters and the Methyl Esters of Ten Chlorophenoxyalkyl Acids, J. Chromatogr., 1978, 157, 97-110, https://doi.org/10.1016/S0021-9673(00)92325-2 . [all data]