5,6-Dioxycarbony[2.2.1]bicyclohept-2-ene

Phase change data

Data compiled by: William E. Acree, Jr., James S. Chickos

Enthalpy of fusion

ΔfusH (kJ/mol) Temperature (K) Method Reference
3.6388.4DSCCurran and Asrar, 1987

References

Curran and Asrar, 1987
Curran, S.A.; Asrar, J., Phase Transitions in 5,6-dioxycarbonyl[2.2.1]bicyclohept-2-ene, Molecular Crystals and Liquid Crystals, 1987, 148, 1, 255-266, https://doi.org/10.1080/00268948708071793 . [all data]