diisopropylbenzene

Phase change data

Data compiled by: Thermodynamics Research Center, NIST Boulder Laboratories, Chris Muzny director

Quantity Value Units Method Reference Comment
Tboil469.KN/AVermillion and Hill, 1946Uncertainty assigned by TRC = 3. K

In addition to the Thermodynamics Research Center (TRC) data available from this site, much more physical and chemical property data is available from the following TRC products:

References

Vermillion and Hill, 1946
Vermillion, G.; Hill, M.A., Catalytic Alkylation of Chlorobenzenes, J. Am. Chem. Soc., 1946, 68, 190. [all data]