Mcpa-thioethyl

Kovats' RI, non-polar column, custom temperature program

View large format table.

Column type Active phase I Reference Comment
CapillaryHP-51826.Tanabe, Mitobe, et al., 200030. m/0.32 mm/0.25 μm; Program: 50C(1min) => 20C/min => 150C => 10C/min => 280C(4min)
CapillaryDB-5MS1835.Tanabe, Mitobe, et al., 199630. m/0.32 mm/0.25 μm; Program: 50 C(1min)->20C/min->200C->10C/min->280C (1.5min)

Normal alkane RI, non-polar column, custom temperature program

View large format table.

Column type Active phase I Reference Comment
CapillaryHP-51826.Kawara, Asada, et al., 200530. m/0.25 mm/0.25 μm; Program: 50 0C (1 min) 20 0C/min -> 150 0C 10 0C/min -> 280 0C

References

Tanabe, Mitobe, et al., 2000
Tanabe, A.; Mitobe, H.; Kawata, K.; Sakai, M.; Yasuhara, A., New monitoring system for ninety pesticides and related compounds in river water by solid-phase extraction with determination by gas chromatography/mass spectrometry, J. AOAC Int., 2000, 83, 1, 61-77. [all data]

Tanabe, Mitobe, et al., 1996
Tanabe, A.; Mitobe, H.; Kawata, K.; Sakai, M., Monitoring of herbicides in river water by gas chromatography-mass spectrometry and solid-phase extraction, J. Chromatogr. A, 1996, 754, 1-2, 159-168, https://doi.org/10.1016/S0021-9673(96)00221-X . [all data]

Kawara, Asada, et al., 2005
Kawara, K.; Asada, T.; Oikawa, K.; Tanabe, A., Multiresidue determination of pesticides in sediments by ultrasonically assisted extraction and gas chromatography/mass spectrometry, J. AOAC International, 2005, 88, 5, 1440-1451. [all data]