3-Nitropyridine
- Formula: C5H4N2O2
- Molecular weight: 124.0975
- IUPAC Standard InChIKey: QLILRKBRWXALIE-UHFFFAOYSA-N
- CAS Registry Number: 2530-26-9
- Chemical structure:

Phase change data

Data compiled by: Robert L. Brown and Stephen E. Stein
Quantity | Value | Units | Method | Reference | Comment |
---|---|---|---|---|---|
Tboil | 489.2 | K | N/A | Weast and Grasselli, 1989 |

Gas phase ion energetics data

Data compiled as indicated in comments:
LLK - Sharon G. Lias, Rhoda D. Levin, and Sherif A. Kafafi
Ionization energy determinations
IE (eV) | Method | Reference | Comment |
---|---|---|---|
10.3 ± 0.1 | EI | Stefanovic and Grutzmacher, 1974 | LLK |

References

Weast and Grasselli, 1989
CRC Handbook of Data on Organic Compounds, 2nd Editon, Weast,R.C and Grasselli, J.G., ed(s)., CRC Press, Inc., Boca Raton, FL, 1989, 1. [all data]
Stefanovic and Grutzmacher, 1974
Stefanovic, D.; Grutzmacher, H.F.,
The ionisation potential of some substituted pyridines,
Org. Mass Spectrom., 1974, 9, 1052. [all data]
Tomasik and Skrowaczewska, 1968
Tomasik, P.; Skrowaczewska, Z.,
Roczniki Chem., 1968, 42, 1427. [all data]