3-Acetyl-2,5-dimethylthiophene

Phase change data

Data compiled by: William E. Acree, Jr., James S. Chickos

Quantity Value Units Method Reference Comment
Δvap14.7 ± 0.31kcal/molCRibeiro da Silva and Santos, 2008

Normal alkane RI, non-polar column, custom temperature program

View large format table.

Column type Active phase I Reference Comment
CapillaryPolydimethyl siloxane1289.Xu, He, et al., 2010Program: 40 0C 20 0C/min -> 60 0C (5 min) 4 0C/min -> 250 0C

References

Ribeiro da Silva and Santos, 2008
Ribeiro da Silva, Manuel A.V.; Santos, Ana Filipa L.O.M., Experimental study on the thermochemistry of 2,5-dimethylthiophene and its acetyl derivative, The Journal of Chemical Thermodynamics, 2008, 40, 8, 1217-1221, https://doi.org/10.1016/j.jct.2008.04.005 . [all data]

Xu, He, et al., 2010
Xu, H.; He, W.; Liu, X.; Gao, Y., Effect of pressure on the Maillard reaction between ribose and cysteine in supercritical carbon dioxide, Czech J. Food Sci., 2010, 28, 3, 192-201. [all data]