Trihexyl phosphate

Kovats' RI, non-polar column, isothermal

Data compiled by: NIST Mass Spectrometry Data Center, William E. Wallace, director

Column type PackedPacked
Active phase SE-30SE-30
Column length (m) 1.2.
Carrier gas N2
Substrate Chromaton N-AW-DMCS
Column diameter (mm)
Phase thickness (μm)
Temperature (C) 240.220.
I 2174.2228.
ReferenceGolovkin, Smol'chenko, et al., 1980Zulaïca and Guiochon, 1963
Comment MSDC-RI MSDC-RI

Phase change data

Data compiled by: William E. Acree, Jr., James S. Chickos

Quantity Value Units Method Reference Comment
Δvap25.05kcal/molCGCPanneerselvam, Antony, et al., 2007Based on data from 483. - 513. K.
Δvap25.07kcal/molN/APanneerselvam, Antony, et al., 2007Based on data from 493. - 523. K.

References

Golovkin, Smol'chenko, et al., 1980
Golovkin, G.V.; Smol'chenko, A.I.; Zotov, L.N.; Sazonov, S.E., Systems of gas-chromatographic retention indices for identifying pesticides by means of selective detectors, Zh. Anal. Khim., 1980, 35, 5, 651-655. [all data]

Zulaïca and Guiochon, 1963
Zulaïca, J.; Guiochon, G., Séparation et identification de di-esters aliphatiques et aromatiques et de trimesters phosphoriques par chromatographie en phase gazeuse, Bull. Soc. Chim. Fr., 1963, 6, 1242-1252. [all data]