tri-n-Amylphosphate

Phase change data

Data compiled by: William E. Acree, Jr., James S. Chickos

Quantity Value Units Method Reference Comment
Δvap22.1kcal/molCGCPanneerselvam, Antony, et al., 2007Based on data from 443. - 473. K.
Δvap21.7kcal/molCGCPanneerselvam, Antony, et al., 2007Based on data from 443. - 483. K.

References

Panneerselvam, Antony, et al., 2007
Panneerselvam, K.; Antony, M.P.; Srinivasan, T.G.; Rao, P.R. Vasudeva, Measurement of enthalpies of vaporization of trialkyl phosphates using correlation gas chromatography, Thermochimica Acta, 2007, 466, 1-2, 49-56, https://doi.org/10.1016/j.tca.2007.10.007 . [all data]