2-methyl-3-thiophenethiol

Van Den Dool and Kratz RI, polar column, custom temperature program

Data compiled by: NIST Mass Spectrometry Data Center, William E. Wallace, director

Column type CapillaryCapillaryCapillaryCapillary
Active phase FFAPCP-Wax 52CBFFAPFFAP
Column length (m) 30.50.30.30.
Carrier gas   HeHe
Substrate
Column diameter (mm) 0.320.320.320.32
Phase thickness (μm) 0.250.210.250.25
Program 35C(2min) => 40C/min => 60C(5min) => 6C/min => 230C(15min)0C(5min) => fast => 60C(5min) => 4C/min => 220C(20min)40C (2min) => 40C/min => 60C (5min) => 6C/min => 230C (15min)40C (2min) => 40C/min => 60C (5min) => 6C/min => 230C (15min)
I 1559.1580.1559.1559.
ReferenceHofmann and Schieberle, 1998Madruga and Mottram, 1998Hofmann and Schieberle, 1995Hofmann and Schieberle, 1995
Comment MSDC-RI MSDC-RI MSDC-RI MSDC-RI

Van Den Dool and Kratz RI, non-polar column, custom temperature program

Data compiled by: NIST Mass Spectrometry Data Center, William E. Wallace, director

Column type CapillaryCapillaryCapillary
Active phase SE-54SE-54DB-5
Column length (m) 30.30.50.
Carrier gas  HeHe
Substrate
Column diameter (mm) 0.320.320.32
Phase thickness (μm) 0.250.25
Program 35C(2min) => 40C/min => 50C(5min) => 6C/min => 230C(15min)40C (2min) => 40C/min => 50C (5min) => 6C/min => 230C (15min)0C => 60C/min => 60C (5min) => 4C/min => 250C
I 1059.1059.1058.
ReferenceHofmann and Schieberle, 1998Hofmann and Schieberle, 1995Mottram and Whitfield, 1995
Comment MSDC-RI MSDC-RI MSDC-RI

References

Hofmann and Schieberle, 1998
Hofmann, T.; Schieberle, P., Identification of key aroma compounds generated from cysteine and carbohydrates under roasting conditions, Z. Lebensm. Unters. Forsch. A, 1998, 207, 3, 229-236, https://doi.org/10.1007/s002170050324 . [all data]

Madruga and Mottram, 1998
Madruga, M.S.; Mottram, D.S., The effect of pH on the formation of volatile compounds produced by heating a model system containing 5'-imp and cysteine, J. Braz. Chem. Soc., 1998, 9, 3, 261-271, https://doi.org/10.1590/S0103-50531998000300010 . [all data]

Hofmann and Schieberle, 1995
Hofmann, T.; Schieberle, P., Evaluation of the key odorants in a thermally treated solution of ribose and cysteine by aroma extract dilution techniques, J. Agric. Food Chem., 1995, 43, 8, 2187-2194, https://doi.org/10.1021/jf00056a042 . [all data]