2-Pyridinecarboxylic acid, ethyl ester
- Formula: C8H9NO2
- Molecular weight: 151.1626
- IUPAC Standard InChIKey: FQYYIPZPELSLDK-UHFFFAOYSA-N
- CAS Registry Number: 2524-52-9
- Chemical structure:

Van Den Dool and Kratz RI, non-polar column, temperature ramp

Column type | Active phase | I | Reference | Comment |
---|---|---|---|---|
Capillary | DB-5 | 1269. | Premecz and Ford, 1987 | He, 60. C @ 10. min, 10. K/min, 280. C @ 3. min; Column length: 30. m; Column diameter: 0.32 mm |

References

Premecz and Ford, 1987
Premecz, J.E.; Ford, M.E.,
Gas chromatographic separation of substituted pyridines,
J. Chromatogr., 1987, 388, 23-35, https://doi.org/10.1016/S0021-9673(01)94463-2
. [all data]