2-Azetidinecarboxylic acid

Condensed phase thermochemistry data

Data compiled by: Hussein Y. Afeefy, Joel F. Liebman, and Stephen E. Stein

Quantity Value Units Method Reference Comment
Δfsolid  CcbZaheeruddin and Lodhi, 1991uncertain value: 25.440 kcal/mol
Quantity Value Units Method Reference Comment
Δcsolid  CcbZaheeruddin and Lodhi, 1991uncertain value: -640.758 kcal/mol

References

Zaheeruddin and Lodhi, 1991
Zaheeruddin, M.; Lodhi, Z.H., Enthalpies of formation of some cyclic compounds, Phys. Chem. (Peshawar Pak.), 1991, 10, 111-118. [all data]