Cyclopropyl carbinol

Phase change data

Data compiled by: Robert L. Brown and Stephen E. Stein

Reduced pressure boiling point

Tboil (K) Pressure (atm) Reference
396.70.971Aldrich Chemical Company Inc., 1990

Reaction thermochemistry data

Data compiled by: John E. Bartmess

Individual Reactions

C4H7O- + Hydrogen cation = Cyclopropyl carbinol

By formula: C4H7O- + H+ = C4H8O

Quantity Value Units Method Reference Comment
Δr374.1 ± 2.9kcal/molG+TSGraul, Schnute, et al., 1990gas phase
Quantity Value Units Method Reference Comment
Δr367.5 ± 2.8kcal/molCIDCGraul, Schnute, et al., 1990gas phase

Gas phase ion energetics data

Data compiled by: John E. Bartmess

De-protonation reactions

C4H7O- + Hydrogen cation = Cyclopropyl carbinol

By formula: C4H7O- + H+ = C4H8O

Quantity Value Units Method Reference Comment
Δr374.1 ± 2.9kcal/molG+TSGraul, Schnute, et al., 1990gas phase
Quantity Value Units Method Reference Comment
Δr367.5 ± 2.8kcal/molCIDCGraul, Schnute, et al., 1990gas phase

Kovats' RI, non-polar column, isothermal

View large format table.

Column type Active phase Temperature (C) I Reference Comment
PackedApiezon L120.648.Bogoslovsky, Anvaer, et al., 1978Celite 545
PackedApiezon L160.656.Bogoslovsky, Anvaer, et al., 1978Celite 545

References

Aldrich Chemical Company Inc., 1990
Aldrich Chemical Company Inc., Catalog Handbook of Fine Chemicals, Aldrich Chemical Company, Inc., Milwaukee WI, 1990, 1. [all data]

Graul, Schnute, et al., 1990
Graul, S.T.; Schnute, M.E.; Squires, R.R., Gas-Phase Acidities of Carboxylic Acids and Alcohols from Collision-Induced Dissociation of Dimer Cluster Ions, Int. J. Mass Spectrom. Ion Proc., 1990, 96, 2, 181, https://doi.org/10.1016/0168-1176(90)87028-F . [all data]

Bogoslovsky, Anvaer, et al., 1978
Bogoslovsky, Yu.N.; Anvaer, B.I.; Vigdergauz, M.S., Chromatographic constants in gas chromatography (in Russian), Standards Publ. House, Moscow, 1978, 192. [all data]