Nonylphenol

Normal alkane RI, non-polar column, temperature ramp

Data compiled by: NIST Mass Spectrometry Data Center, William E. Wallace, director

Column type CapillaryCapillary
Active phase HP-5Ultra-2
Column length (m) 30.50.
Carrier gas H2He
Substrate
Column diameter (mm) 0.250.32
Phase thickness (μm) 0.250.52
Tstart (C) 40.40.
Tend (C) 280.250.
Heat rate (K/min) 3.4.
Initial hold (min) 10.3.
Final hold (min) 10.30.
I 1720.1733.
ReferenceBicalho, Pereira, et al., 2000King, Hamilton, et al., 1993
Comment MSDC-RI MSDC-RI

References

Bicalho, Pereira, et al., 2000
Bicalho, B.; Pereira, A.S.; Aquino Neto, F.R.; Pinto, A.C.; Rezende, C.M., Application of high-temperature gas chromatography-mass spectrometry to the investigation of glycosidically bound components related to cashew applie (Anacardium occidentale L. Var. nanum) volatiles, J. Agric. Food Chem., 2000, 48, 4, 1167-1174, https://doi.org/10.1021/jf9909252 . [all data]

King, Hamilton, et al., 1993
King, M.-F.; Hamilton, B.L.; Matthews, M.A.; Rule, D.C.; Field, R.A., Isolation and identification of volatiles and condensable material in raw beef with supercritical carbon dioxide extraction, J. Agric. Food Chem., 1993, 41, 11, 1974-1981, https://doi.org/10.1021/jf00035a030 . [all data]