4-Methylheneicosane

Phase change data

Data compiled by: William E. Acree, Jr., James S. Chickos

Enthalpy of vaporization

ΔvapH (kcal/mol) Temperature (K) Method Reference Comment
16.9494.AStephenson and Malanowski, 1987Based on data from 497. - 632. K. See also Dykyj, Svoboda, et al., 1999 and Terres, Brinkmann, et al., 1959.

References

Stephenson and Malanowski, 1987
Stephenson, Richard M.; Malanowski, Stanislaw, Handbook of the Thermodynamics of Organic Compounds, 1987, https://doi.org/10.1007/978-94-009-3173-2 . [all data]

Dykyj, Svoboda, et al., 1999
Dykyj, J.; Svoboda, J.; Wilhoit, R.C.; Frenkel, M.L.; Hall, K.R., Vapor Pressure of Chemicals: Part A. Vapor Pressure and Antoine Constants for Hydrocarbons and Sulfur, Selenium, Tellurium and Hydrogen Containing Organic Compounds, Springer, Berlin, 1999, 373. [all data]

Terres, Brinkmann, et al., 1959
Terres, E.; Brinkmann, L.; Fischer, D.; Hüllstrung, D.; Loz, W.; Weisbrod, G., Brennst.-Chem., 1959, 40, 279. [all data]