Nonadecane, 4-methyl-

Van Den Dool and Kratz RI, non-polar column, temperature ramp

Data compiled by: NIST Mass Spectrometry Data Center, William E. Wallace, director

Column type Capillary
Active phase Cross-Linked Methylsilicone
Column length (m)
Carrier gas
Substrate
Column diameter (mm)
Phase thickness (μm)
Tstart (C) 40.
Tend (C) 300.
Heat rate (K/min) 5.
Initial hold (min)
Final hold (min)
I 1960.
ReferenceKhorasheh, Gray, et al., 1989
Comment MSDC-RI

Phase change data

Data compiled by: William E. Acree, Jr., James S. Chickos

Enthalpy of vaporization

ΔvapH (kJ/mol) Temperature (K) Method Reference Comment
68.4475.AStephenson and Malanowski, 1987Based on data from 460. - 609. K. See also Terres, Brinkmann, et al., 1959.

Normal alkane RI, non-polar column, temperature ramp

Data compiled by: NIST Mass Spectrometry Data Center, William E. Wallace, director

Column type Capillary
Active phase OV-1
Column length (m) 100.
Carrier gas Helium
Substrate
Column diameter (mm) 0.32
Phase thickness (μm) 0.25
Tstart (C) 30.
Tend (C) 310.
Heat rate (K/min) 5.
Initial hold (min)
Final hold (min) 5.
I 1959.9
ReferenceKrkosova, Kubinec, et al., 2007
Comment MSDC-RI

Van Den Dool and Kratz RI, polar column, custom temperature program

Data compiled by: NIST Mass Spectrometry Data Center, William E. Wallace, director

Column type Capillary
Active phase CP-Wax 52CB
Column length (m) 60.
Carrier gas He
Substrate
Column diameter (mm) 0.25
Phase thickness (μm) 0.25
Program 45C(5min) => 10C/min => 80C => 2C/min => 240C
I 1953.
ReferenceRomeo, Ziino, et al., 2007
Comment MSDC-RI

References

Khorasheh, Gray, et al., 1989
Khorasheh, F.; Gray, M.R.; Selucky, M.L., Correlation for Kováts retention index of C9-C26 monoalkyl and polymethyl alkanes and alkenes, J. Chromatogr., 1989, 481, 1-16, https://doi.org/10.1016/S0021-9673(01)96747-0 . [all data]