Tetradecane, 4-methyl-
- Formula: C15H32
- Molecular weight: 212.4146
- IUPAC Standard InChIKey: ITVMHPMCNRGCIY-UHFFFAOYSA-N
- CAS Registry Number: 25117-24-2
- Chemical structure:

Phase change data

Data compiled as indicated in comments:
TRC - Thermodynamics Research Center, NIST Boulder Laboratories, Chris Muzny director
AC - William E. Acree, Jr., James S. Chickos
Quantity | Value | Units | Method | Reference | Comment |
---|---|---|---|---|---|
Tfus | 240.3 | K | N/A | Petrov, Sergienko, et al., 1959 | Uncertainty assigned by TRC = 2. K; TRC |
Enthalpy of vaporization
ΔvapH (kcal/mol) | Temperature (K) | Method | Reference | Comment |
---|---|---|---|---|
13.4 | 413. | A | Stephenson and Malanowski, 1987 | Based on data from 398. to 536. K.; AC |

Kovats' RI, non-polar column, isothermal

Column type | Active phase | Temperature (C) | I | Reference | Comment |
---|---|---|---|---|---|
Capillary | Apiezon L | 100. | 1454. | Rappoport and Gäumann, 1973 |

Van Den Dool and Kratz RI, non-polar column, temperature ramp

Column type | Active phase | I | Reference | Comment |
---|---|---|---|---|
Capillary | Cross-Linked Methylsilicone | 1460. | Khorasheh, Gray, et al., 1989 | 5. K/min; Tstart: 40. C; Tend: 300. C |
Capillary | Ultra-1 | 1459.27 | Haynes and Pitzer, 1985 | 50. m/0.22 mm/0.33 μm, He, 1. K/min; Tstart: -30. C; Tend: 240. C |
Capillary | Ultra-1 | 1459.71 | Haynes and Pitzer, 1985 | 50. m/0.22 mm/0.33 μm, He, 2. K/min; Tstart: -30. C; Tend: 240. C |
Capillary | Ultra-1 | 1459.66 | Haynes and Pitzer, 1985 | 50. m/0.22 mm/0.33 μm, He, 3. K/min; Tstart: -30. C; Tend: 240. C |
Capillary | Ultra-2 | 1458.66 | Haynes and Pitzer, 1985 | 50. m/0.22 mm/0.33 μm, He, 1. K/min; Tstart: -30. C; Tend: 240. C |
Capillary | Ultra-2 | 1458.78 | Haynes and Pitzer, 1985 | 50. m/0.22 mm/0.33 μm, He, 2. K/min; Tstart: -30. C; Tend: 240. C |
Capillary | Ultra-2 | 1458.78 | Haynes and Pitzer, 1985 | 50. m/0.22 mm/0.33 μm, He, 3. K/min; Tstart: -30. C; Tend: 240. C |

Van Den Dool and Kratz RI, non-polar column, custom temperature program

Column type | Active phase | I | Reference | Comment |
---|---|---|---|---|
Capillary | DB-5 | 1460. | Zaikin and Borisov, 2002 | He; Column length: 30. m; Column diameter: 0.25 mm; Program: 30C => 5K/min=120C => 10C/min => 270C |

Van Den Dool and Kratz RI, polar column, custom temperature program

Column type | Active phase | I | Reference | Comment |
---|---|---|---|---|
Capillary | CP-Wax 52CB | 1455. | Romeo, Ziino, et al., 2007 | 60. m/0.25 mm/0.25 μm, He; Program: 45C(5min) => 10C/min => 80C => 2C/min => 240C |

Normal alkane RI, non-polar column, temperature ramp

Column type | Active phase | I | Reference | Comment |
---|---|---|---|---|
Capillary | HP-5 MS | 1457. | Radulovic, Blagojevic, et al., 2010 | 30. m/0.25 mm/0.25 μm, Helium, 5. K/min, 290. C @ 10. min; Tstart: 70. C |
Capillary | HP-5 MS | 1462. | Radulovic, Dordevic, et al., 2010 | 30. m/0.25 mm/0.25 μm, Helium, 5. K/min, 290. C @ 10. min; Tstart: 70. C |
Capillary | OV-1 | 1460.2 | Krkosova, Kubinec, et al., 2007 | 100. m/0.32 mm/0.25 μm, Helium, 5. K/min, 310. C @ 5. min; Tstart: 30. C |

Normal alkane RI, non-polar column, custom temperature program

Column type | Active phase | I | Reference | Comment |
---|---|---|---|---|
Capillary | Squalane | 1454. | Petrov, 1984 | Program: not specified |
Capillary | Apiezon L | 1455. | Shlyakhov, 1984 | Program: not specified |

References

Petrov, Sergienko, et al., 1959
Petrov, A.A.; Sergienko, S.R.; Nechitailo, N.A.; Tsedilina, A.L.,
Izv. Akad. Nauk SSSR, 1959, 1959, 1091-7. [all data]
Stephenson and Malanowski, 1987
Stephenson, Richard M.; Malanowski, Stanislaw,
Handbook of the Thermodynamics of Organic Compounds, 1987, https://doi.org/10.1007/978-94-009-3173-2
. [all data]
Rappoport and Gäumann, 1973
Rappoport, S.; Gäumann, T.,
114. L'indice de rétention des alcanes isomères en chromatographie en phase gazeuse,
Helv. Chim. Acta, 1973, 56, 3, 1145-1158, https://doi.org/10.1002/hlca.19730560338
. [all data]
Khorasheh, Gray, et al., 1989
Khorasheh, F.; Gray, M.R.; Selucky, M.L.,
Correlation for Kováts retention index of C9-C26 monoalkyl and polymethyl alkanes and alkenes,
J. Chromatogr., 1989, 481, 1-16, https://doi.org/10.1016/S0021-9673(01)96747-0
. [all data]
Haynes and Pitzer, 1985
Haynes, P.C., Jr.; Pitzer, E.W.,
Disengaging solutes in shale- and petroleum-derived jet fuels by altering GC programmed temperature rates,
J. Hi. Res. Chromatogr. Chromatogr. Comm., 1985, 8, 5, 230-242, https://doi.org/10.1002/jhrc.1240080504
. [all data]
Zaikin and Borisov, 2002
Zaikin, V.G.; Borisov, R.S.,
Chromatographic-mass spectrometric analysis of Fishcer-Tropsch synthesis products,
J. Anal. Chem. USSR (Engl. Transl.), 2002, 57, 6, 544-551. [all data]
Romeo, Ziino, et al., 2007
Romeo, V.; Ziino, M.; Giuffrrida, D.; Condurso, C.; Verzera, A.,
Flavour profile of capers (Capparis spinosa L.) from the Eolian Archipelago by HS-SPME/GC?MS,
Food Chem., 2007, 101, 3, 1272-1278, https://doi.org/10.1016/j.foodchem.2005.12.029
. [all data]
Radulovic, Blagojevic, et al., 2010
Radulovic, N.; Blagojevic, P.; Palic, R.,
Comparative study of the leaf volatiles of Arctostaphylos uva-ursi (L.) Spreng. and Vaccinium vitis-idaea L. (Ericaceae),
Molecules, 2010, 15, 9, 6168-6185, https://doi.org/10.3390/molecules15096168
. [all data]
Radulovic, Dordevic, et al., 2010
Radulovic, N.; Dordevic, N.; Markovic, M.; Palic, R.,
Volatile constituents of Glechoma Hirsuta Waldst. Kit. and G. Hederacea L. (Lamiaceae),
Bull. Chem. Soc. Ethiop., 2010, 24, 1, 67-76, https://doi.org/10.4314/bcse.v24i1.52962
. [all data]
Krkosova, Kubinec, et al., 2007
Krkosova, Z.; Kubinec, R.; Addova, G.; Jurdakova, H.; Blasko, J.; Ostrovsky, I.; Sojak, L.,
Gas chromatographic - mass spectrometric characterization of monomethylalkanes from fuel diesel,
Petroleum Coal, 2007, 49, 3, 51-62. [all data]
Petrov, 1984
Petrov, A.A.,
Hydrocarbons of petroleum, Nauka (publishing house), Moscow, 1984, 263. [all data]
Shlyakhov, 1984
Shlyakhov, A.F.,
Gas chromatography in organic geochemistry, Nedra, Moscow, 1984, 221. [all data]