Benzeneacetonitrile, α-(phenylmethylene)-

Condensed phase thermochemistry data

Data compiled by: Hussein Y. Afeefy, Joel F. Liebman, and Stephen E. Stein

Quantity Value Units Method Reference Comment
Δfsolid353.kJ/molCcbZavoianu, Contineanu, et al., 1986
Δfsolid352.kJ/molCcbZavoianu, Perisanu, et al., 1982Authors hf298_condensed=66.1 kcal/mol
Quantity Value Units Method Reference Comment
Δcsolid-7831.kJ/molCcbZavoianu, Contineanu, et al., 1986
Δcsolid-7827.0kJ/molCcbZavoianu, Perisanu, et al., 1982Authors hf298_condensed=66.1 kcal/mol

References

Zavoianu, Contineanu, et al., 1986
Zavoianu, D.; Contineanu, I.; Moga-Gheorghe, S.; Marchidan, D., Structure and reactivity of nitriles. Condensation reaction of phenylacetonitrile with benzaldehydes, Rev. Chim. (Bucharest), 1986, 37, 1055-1058. [all data]

Zavoianu, Perisanu, et al., 1982
Zavoianu, D.; Perisanu, S.; Moga-Gheorghe, S.; Bornaz, C.; Gaman, V.; Radulescu, A., Structure and reactivity of nitriles. Heat of combustion and of formation of unsaturated α,β-nitriles derived from benzylidenephenylacetonitrile, Rev. Chim. (Bucharest), 1982, 33, 432-434. [all data]