Hexanedioic acid, polymer with 1,4-butanediol

Condensed phase thermochemistry data

Data compiled by: Eugene S. Domalski and Elizabeth D. Hearing

Quantity Value Units Method Reference Comment
solid,1 bar334.9J/mol*KN/ARabinovich, Nistratov, et al., 1984100% crystallinity. S°(298.15 K) - S°(O) = 379.9 J/mol*K for the highly elastic state.

Constant pressure heat capacity of solid

Cp,solid (J/mol*K) Temperature (K) Reference Comment
316.7298.15Rabinovich, Nistratov, et al., 1984T = 80 to 470 K. 100% crystallinity. Cp(298.15 K) = 393.6 J/mol*K for the highly elastic state.

References

Rabinovich, Nistratov, et al., 1984
Rabinovich, I.B.; Nistratov, V.P.; Babinkov, A.G.; Shvetsova, K.G.; Larina, V.N., Thermodynamic properties of polybutyleneglycol adipate, Vysokomol. Soedin., 1984, A26, 743-747. [all data]