Thieno[2,3-b]thiophene

Van Den Dool and Kratz RI, non-polar column, temperature ramp

View large format table.

Column type Active phase I Reference Comment
CapillaryCP Sil 8 CB1225.Elmore, Campo, et al., 200260. m/0.25 mm/0.25 μm, He, 40. C @ 2. min, 4. K/min; Tend: 280. C
CapillaryBPX-51239.Ames, Guy, et al., 200150. m/0.32 mm/0.5 μm, He, 60. C @ 5. min, 4. K/min, 250. C @ 10. min

Van Den Dool and Kratz RI, non-polar column, custom temperature program

View large format table.

Column type Active phase I Reference Comment
CapillaryDB-51212.Mottram and Whitfield, 1995He; Column length: 50. m; Column diameter: 0.32 mm; Program: 0C => 60C/min => 60C (5min) => 4C/min => 250C

Normal alkane RI, non-polar column, custom temperature program

View large format table.

Column type Active phase I Reference Comment
CapillaryPolydimethyl siloxane1220.Xu, He, et al., 2010Program: 40 0C 20 0C/min -> 60 0C (5 min) 4 0C/min -> 250 0C

Lee's RI, non-polar column, custom temperature program

View large format table.

Column type Active phase I Reference Comment
CapillarySPB-5201.25Thuss, Popp, et al., 200060. m/0.32 mm/0.10 μm, He; Program: A: 105 0C (2 min) 2.5 0C -> 230 0C 50 0C/min -> 305 0C (15 min) B: 95 0C (2 min) 3.8 0C/min -> 310 0C (5 min)

References

Elmore, Campo, et al., 2002
Elmore, J.S.; Campo, M.M.; Enser, M.; Mottram, D.S., Effect of lipid composition on meat-like model systems containing cysteine, ribose, and polyunsaturated fatty acids, J. Agric. Food Chem., 2002, 50, 5, 1126-1132, https://doi.org/10.1021/jf0108718 . [all data]

Ames, Guy, et al., 2001
Ames, J.M.; Guy, R.C.E.; Kipping, G.J., Effect of pH and temperature on the formation of volatile compounds in cysteine/reducing sugar/starch mixtures during extrusion cooking, J. Agric. Food Chem., 2001, 49, 4, 1885-1894, https://doi.org/10.1021/jf0012547 . [all data]

Mottram and Whitfield, 1995
Mottram, D.S.; Whitfield, F.B., Volatile compounds from the reaction of cysteine, ribose, and phospholipid in low-moisture systems, J. Agric. Food Chem., 1995, 43, 4, 984-988, https://doi.org/10.1021/jf00052a027 . [all data]

Xu, He, et al., 2010
Xu, H.; He, W.; Liu, X.; Gao, Y., Effect of pressure on the Maillard reaction between ribose and cysteine in supercritical carbon dioxide, Czech J. Food Sci., 2010, 28, 3, 192-201. [all data]

Thuss, Popp, et al., 2000
Thuss, U.; Popp, P.; Ehrlich, C.; Kalkoff, W.-D., Identification and quantification of thaarenes in the flue gas of lignite-fired domestic heating, J. Hi. Res. Chromatogr., 2000, 23, 7/8, 457-473, https://doi.org/10.1002/1521-4168(20000801)23:7/8<457::AID-JHRC457>3.0.CO;2-7 . [all data]