Poly-1,3-dioxolane

Condensed phase thermochemistry data

Data compiled by: Eugene S. Domalski and Elizabeth D. Hearing

Quantity Value Units Method Reference Comment
solid,1 bar26.86cal/mol*KN/AClegg and Melia, 1969

Constant pressure heat capacity of solid

Cp,solid (cal/mol*K) Temperature (K) Reference Comment
27.03298.15Clegg and Melia, 1969T = 80 to 390 K. Extrapolated data.

References

Clegg and Melia, 1969
Clegg, G.A.; Melia, T.P., Thermodynamics of polymerization of heterocyclic compounds. Part V. The heat capacity, entropy, enthalpy and free energy of 1,3-dioxolan and poly-1,3-dioxolan, Polymer, 1969, 10(12), 912-922. [all data]